{"text_format":"1","workbook":"xlsx","n_sheets":3,"sheets":["Anleitung","Gruppenblatt","Konfig"],"not_rendered":{"charts":0,"images":1,"macros":1,"external_links":0,"defined_names":15,"comments":0,"pivot_tables":0},"unopened":[],"bounds":{"document_bytes":16777216,"sheet_cells":100000,"rows_first":2000,"rows_last":500,"rows_between":2000,"halvings":0,"cell_chars":16384,"cell_head_chars":4096},"cells_cut":0,"cells_raw":0,"read":"whole","date_system":"1900"}

{"sheet":"Anleitung","index":0,"n_rows":19,"n_cols":6,"rows_kept":19,"cut":false,"hidden":false,"merged":[[1,1,2,4],[1,5,2,5],[13,1,13,2],[6,1,6,4],[3,1,3,4],[4,1,4,4],[5,1,5,4],[9,4,13,4]]}
[]
[null,"Liebe Gruppenleiter/innen,\nschön, dass du dich mit deiner Gruppe zum Bundeslager anmelden möchtest.\n\nEin zentrales Dokument der Anmeldung ist diese Liste.\nFür uns als Veranstalter ist sie wichtig, da wir daraus die Daten erhalten, die wir zur Vorbereitung des Lagers benötigen- aber auch für dich ist sie hilfreich, alle relevanten Informationen zu deinen Teilnehmern und Teilnehmerinnen auf einen Blick zusammen zu haben. Daher bitten wir dich, alle Informationen, die auf dem Teilnahmebogen stehen, für jede/n Teilnehmer/in vollständig in diese Liste zu übertragen. Bitte verändere nichts in der Liste und verwende nur die Originalliste.\nIn der ersten Zeile trägst du dich bzw. die verantwortliche Gruppenleitung für die Gruppe ein, die auch im Bundeslager den Check-in für die Gruppe macht. \nIn diese Zeile werden auch Informationen für die Gruppe angegeben, d.h. die Angabe zu Zelten und mit welchen Verkehrsmitteln ihr anreist.\nSollte es bis zum Bundeslager Veränderungen geben, weil sich z.B. Teilnehmer/innen abmelden, ihr zusätzliche Teilnehmer/innen nachmeldet oder sich bei den Zelten etwa ändert, aktualisiert bitte die Liste und sendet sie an die Mailadresse bundesjugendlager@malteser.org\n \nWas gehört zur Anmeldung?\nZu einer fristgerechten und verbindlichen Anmeldung müssen folgende Dokumente über eure Diözesanjugendreferate an die Adresse bundesjugendlager@malteser.org gesendet werden:\n• Vollständige Excel Liste: in diese werden alle Informationen der Gruppe, sowie zu allen Teilnehmenden vollständig eingetragen. \n• Kopie aller Teilnahmebögen: Die TN- Bögen bleiben im Original bei der verantwortlichen Gruppenleitung und sollten zum Bundeslager mitgeführt werden, falls die original Unterschrift der Eltern benötigt werden sollte. Eine Kopie der Teilnahmebögen wird eingescannt und ebenfalls mitgesendet- dies gilt zur Sicherheit, falls Bögen vergessen/verloren gehen oder z.B. das Sani-Team im Notfall ohne Rücksprache mit der Gruppenleitung handeln muss.\n• Der vollständig ausgefüllte Ila: Dieser wird digital mitgesendet. (Dazu am besten frühzeitig mit der Ortsleitung oder im Jugendreferat abklären, wer den ausstellt und wie die (Weiter)Berechnung der Teilnahmebeiträge läuft.)\nDer bisherige Gruppenameldungsbogen entfällt, da die Daten alle in diese Liste eingetragen werden.\n\nNach Einsendung aller vollständigen Unterlagen erhaltet ihr eine kurze Bestätigung per Email. Sollten Unterlagen fehlen, erhaltet ihr eine Erinnerung. Falls die vollständigen Unterlagen nicht fristgerecht (bis 1.Juni 2017) eingehen, erhöht sich der Teilnahmebeitrag pro Person um 20 Euro. Auch wenn wegen des Dienstweges alle Anmeldungen über das Diözesanjugendreferat gehen, ist es Aufgabe der Gruppenleitung, dass alle Unterlagen rechtzeitig im Bundesjugendreferat eingehen!\n\nAbmeldung:\n• Abmeldung von Teilnehmenden: bis 14. Juli sendet ihr den Namen an Bundesjugendlager@malteser.org. Wir löschen die Person aus der Liste und passen den ILA an. \n• Alle Abmeldungen, die nach dem 14.Juli eingehen werden berechnet.  \n• Der ILA wird zwei Wochen vor Lagerbeginn berechnet. \n \nBei Nachmeldungen:\n• Für eine Nachmeldung von Personen nach dem 1.Juni wird die Gruppen Excel Liste von euch um die Person(en) und allen Informationen ergänzt und zusammen mit dem Teilnahmebogen an das Bundeslager Postfach geschickt.\n• 14 Tage vor dem Lager wird der ILA mit allen Nachmeldungen berechnet. \n• Sollten 14 Tage vor dem Lager weitere Nachmeldungen erfolgen, werden diese direkt nach der Nachmeldung berechnet.    \n\nWichtig: Nur Unterlagen, die an bundesjugendlager@malteser.org gehen gelten als verbindlich. An/Abmeldungen auf anderem Wege oder an andere Adressen sind nicht möglich und werden seitens des Bundesjugendreferats auch nicht berücksichtigt.\n\nEin kleiner Tipp: Diese Teilnehmerliste kannst Du einfach ausdrucken, dann bekommst du die wichtigsten Informationen für das Lager auf eine Seite.\n\nBei Fragen wendet euch gerne an: bundesjugendlager@malteser.org\n\nBitte bestätige die drei Aussagen (einfach das rote Feld anklicken), dann wird das Blatt mit der Gruppenanmeldung geöffnet!",null,null,null,"Hier Klicken (nichts tippen!) zum Bestätigen →"]
[]
[null,"Hiermit bestätige ich, dass ich für alle Teilnehmenden einen ausgefüllten (bei Minderjährigen von den Erziehungsberechtigten) Teilnahmebogen vorliegen habe, den ich zum Bundeslager mitführen werde:"]
[null,"Ich werde alle im Bogen angegeben Daten plus die Informationen zur Gruppe in die Liste übertragen. Unklarheiten oder fehlende Angaben (vor allem zu Gesundheit oder Bild/Fotorechten) kläre ich (im Vorfeld) mit den Erziehungsberechtigten."]
[null,"Liste und Bögen sende ich zusammen mit einem Internen Leistungsaustausch als verbindliche Gruppenabmeldung über das Diözesanjugendreferat an das Bundesjugendreferat."]
[]
[null,"Bundeslagerdaten"]
[null,"Beginn","Ende","Anmeldeschluss BJR","Dienstweg"]
[null,"2017-07-29","2017-08-05","2017-06-01","~ Anmeldegögen einscannen\n~ ILA ausfüllen\n~ Exeliste, Anmeldebögen und ILA per Email an das Diözesanjugendreferat senden.\n~ Diözesanjugendreferentin/en leiten an das Bundesjugendreferat (bundesjugendlager@malteser.org) weiter\n~ Originalteilnehmerbögen verbleiben beim Gruppenleiter (Aufbewahrungspflicht!) \nAdressen oder Kontakt: \nauf www.malteserjugend.de findet Ihr unter \"Uns gibt es in…\" eine Liste aller Diözesanjugendreferate!"]
[null,"Ort","Diözese"]
[null,"Mammendorf","München"]
[null,"Rückfragen an"]
[null,"Clara Bönsch, Tel: 0221/98 22 241\nEmail: bundesjugendlager@malteser.org"]
[]
[null,"Name deines Ortes:"]
[null,"Name deiner Diözese:"]
[null,"Dein Name"]
[null,"Anleitung bestätigt:"]

{"sheet":"Gruppenblatt","index":1,"n_rows":50,"n_cols":58,"rows_kept":50,"cut":false,"hidden":true,"merged":[]}
["Diözese","Ort","Anrede","Vorname","Name","Straße","PLZ","Wohnort","Telefon","Handy","Gebdat","Name Erziehungs-berechtigte/r","Notfalltelefon Erziehungs-berechtigte/r","Name Notfall zus. Ansprech-partner/in","Notfall Verwandschafts-verhältnis zus. Anspr.","Telefon zus. Ansprechpartner Notfall","Fotorechten zugestimmt","Alter (automatisch)","Email","Infobrief per Mail?","MHD \nMitglied","verantwortl.\n GL","Gruppen-leiter-assistent","Gruppen -mitglied","Name des Rechnungs- empfängers","Medikamente","Allergien","Bemerkung, besonderer Unterstützungsbedarf","Name der Kranken- kasse","Kranken-kassen-nummer","Versiche- rungs- Nummer","Name des Haupt-versicherten","Geburtsdatum Haupt-versicherter","Voll- kost","Vege-tarier","Lakto-sefrei","Sonderkost\n(z.B. Glutenfrei)","TN ist Schwimmer / Nichtschwimmer","TN darf schwim- men","T-Shirt\nGröße 122/128","T-Shirt Größe 134/146","T-Shirt Größe 152/164","T-Shirt Größe XS","T-Shirt        Größe S","T-Shirt        Größe M","T-Shirt        Größe L","T-Shirt        Größe XL","T-Shirt        Größe XXL","T-Shirt Größe XXXL","Bemerkungen (zum Teilnehmenden)","Bemerkungen (zur Gruppe)","Patenschaften\nmit ","Anzahl Zelte und Zelttyp","Anreise per","Anreisemittel bleibt vor Ort","Summen\n1. Gruppe\n2. GL\n3. GLA","Anmelde- datum \nim BJR","Betrag"]
[null,null,null,null,null,null,null,null,null,null,null,null,null,null,null,null,null,{"$f":"IF((ISBLANK(K2)),\"\",YEAR(Anleitung!$B$10-K2)-1900)","v":""},null,null,null,null,null,null,null,null,null,null,null,null,null,null,null,{"$f":"IF(D2=\"\",\"\",IF(1-MAX(AI2:AJ2)=0,\"\",1))","v":""},null,null,null,null,null,null,null,null,null,null,null,null,null,null,null,null,null,null,null,null,null,{"$f":"\"1. \" & COUNTIF(E2:E50,\"*\")","v":"1. 0"},null,{"$f":"IF(OR(ISBLANK(U2),ISBLANK(BE2)),\"\",VLOOKUP(U2&\"/\"&(BE2<=Anleitung!$D$10),Konfig!D:E,2,FALSE))","v":""}]
[{"$f":"IF(D3=\"\",\"\",$A$2)","v":""},{"$f":"IF(E3=\"\",\"\",$B$2)","v":""},null,null,null,null,null,null,null,null,null,null,null,null,null,null,null,{"$f":"IF((ISBLANK(K3)),\"\",YEAR(Anleitung!$B$10-K3)-1900)","v":""},null,null,null,null,null,null,null,null,null,null,null,null,null,null,null,"",null,null,null,null,null,null,null,null,null,null,null,null,null,null,null,null,null,null,null,null,null,{"$f":"\"2. \" & COUNTIF(V:V,\"Ja\")","v":"2. 0"},null,{"$f":"IF(OR(ISBLANK(U3),ISBLANK(BE3)),\"\",VLOOKUP(U3&\"/\"&(BE3<=Anleitung!$D$10),Konfig!D:E,2,FALSE))","v":""}]
["",{"$f":"IF(E4=\"\",\"\",$B$2)","v":""},null,null,null,null,null,null,null,null,null,null,null,null,null,null,null,{"$f":"IF((ISBLANK(K4)),\"\",YEAR(Anleitung!$B$10-K4)-1900)","v":""},null,null,null,null,null,null,null,null,null,null,null,null,null,null,null,"",null,null,null,null,null,null,null,null,null,null,null,null,null,null,null,null,null,null,null,null,null,{"$f":"\"3. \" & COUNTIF(W:W,\"Ja\")","v":"3. 0"},null,{"$f":"IF(OR(ISBLANK(U4),ISBLANK(BE4)),\"\",VLOOKUP(U4&\"/\"&(BE4<=Anleitung!$D$10),Konfig!D:E,2,FALSE))","v":""}]
["","",null,null,null,null,null,null,null,null,null,null,null,null,null,null,null,{"$f":"IF((ISBLANK(K5)),\"\",YEAR(Anleitung!$B$10-K5)-1900)","v":""},null,null,null,null,null,null,null,null,null,null,null,null,null,null,null,"",null,null,null,null,null,null,null,null,null,null,null,null,null,null,null,null,null,null,null,null,null,null,null,{"$f":"IF(OR(ISBLANK(U5),ISBLANK(BE5)),\"\",VLOOKUP(U5&\"/\"&(BE5<=Anleitung!$D$10),Konfig!D:E,2,FALSE))","v":""}]
["","",null,null,null,null,null,null,null,null,null,null,null,null,null,null,null,{"$f":"IF((ISBLANK(K6)),\"\",YEAR(Anleitung!$B$10-K6)-1900)","v":""},null,null,null,null,null,null,null,null,null,null,null,null,null,null,null,"",null,null,null,null,null,null,null,null,null,null,null,null,null,null,null,null,null,null,null,null,null,null,null,{"$f":"IF(OR(ISBLANK(U6),ISBLANK(BE6)),\"\",VLOOKUP(U6&\"/\"&(BE6<=Anleitung!$D$10),Konfig!D:E,2,FALSE))","v":""}]
["","",null,null,null,null,null,null,null,null,null,null,null,null,null,null,null,{"$f":"IF((ISBLANK(K7)),\"\",YEAR(Anleitung!$B$10-K7)-1900)","v":""},null,null,null,null,null,null,null,null,null,null,null,null,null,null,null,"",null,null,null,null,null,null,null,null,null,null,null,null,null,null,null,null,null,null,null,null,null,null,null,{"$f":"IF(OR(ISBLANK(U7),ISBLANK(BE7)),\"\",VLOOKUP(U7&\"/\"&(BE7<=Anleitung!$D$10),Konfig!D:E,2,FALSE))","v":""}]
["","",null,null,null,null,null,null,null,null,null,null,null,null,null,null,null,{"$f":"IF((ISBLANK(K8)),\"\",YEAR(Anleitung!$B$10-K8)-1900)","v":""},null,null,null,null,null,null,null,null,null,null,null,null,null,null,null,"",null,null,null,null,null,null,null,null,null,null,null,null,null,null,null,null,null,null,null,null,null,null,null,{"$f":"IF(OR(ISBLANK(U8),ISBLANK(BE8)),\"\",VLOOKUP(U8&\"/\"&(BE8<=Anleitung!$D$10),Konfig!D:E,2,FALSE))","v":""}]
["","",null,null,null,null,null,null,null,null,null,null,null,null,null,null,null,{"$f":"IF((ISBLANK(K9)),\"\",YEAR(Anleitung!$B$10-K9)-1900)","v":""},null,null,null,null,null,null,null,null,null,null,null,null,null,null,null,"",null,null,null,null,null,null,null,null,null,null,null,null,null,null,null,null,null,null,null,null,null,null,null,{"$f":"IF(OR(ISBLANK(U9),ISBLANK(BE9)),\"\",VLOOKUP(U9&\"/\"&(BE9<=Anleitung!$D$10),Konfig!D:E,2,FALSE))","v":""}]
["","",null,null,null,null,null,null,null,null,null,null,null,null,null,null,null,{"$f":"IF((ISBLANK(K10)),\"\",YEAR(Anleitung!$B$10-K10)-1900)","v":""},null,null,null,null,null,null,null,null,null,null,null,null,null,null,null,"",null,null,null,null,null,null,null,null,null,null,null,null,null,null,null,null,null,null,null,null,null,null,null,{"$f":"IF(OR(ISBLANK(U10),ISBLANK(BE10)),\"\",VLOOKUP(U10&\"/\"&(BE10<=Anleitung!$D$10),Konfig!D:E,2,FALSE))","v":""}]
["","",null,null,null,null,null,null,null,null,null,null,null,null,null,null,null,{"$f":"IF((ISBLANK(K11)),\"\",YEAR(Anleitung!$B$10-K11)-1900)","v":""},null,null,null,null,null,null,null,null,null,null,null,null,null,null,null,"",null,null,null,null,null,null,null,null,null,null,null,null,null,null,null,null,null,null,null,null,null,null,null,{"$f":"IF(OR(ISBLANK(U11),ISBLANK(BE11)),\"\",VLOOKUP(U11&\"/\"&(BE11<=Anleitung!$D$10),Konfig!D:E,2,FALSE))","v":""}]
["","",null,null,null,null,null,null,null,null,null,null,null,null,null,null,null,{"$f":"IF((ISBLANK(K12)),\"\",YEAR(Anleitung!$B$10-K12)-1900)","v":""},null,null,null,null,null,null,null,null,null,null,null,null,null,null,null,"",null,null,null,null,null,null,null,null,null,null,null,null,null,null,null,null,null,null,null,null,null,null,null,{"$f":"IF(OR(ISBLANK(U12),ISBLANK(BE12)),\"\",VLOOKUP(U12&\"/\"&(BE12<=Anleitung!$D$10),Konfig!D:E,2,FALSE))","v":""}]
["","",null,null,null,null,null,null,null,null,null,null,null,null,null,null,null,{"$f":"IF((ISBLANK(K13)),\"\",YEAR(Anleitung!$B$10-K13)-1900)","v":""},null,null,null,null,null,null,null,null,null,null,null,null,null,null,null,"",null,null,null,null,null,null,null,null,null,null,null,null,null,null,null,null,null,null,null,null,null,null,null,{"$f":"IF(OR(ISBLANK(U13),ISBLANK(BE13)),\"\",VLOOKUP(U13&\"/\"&(BE13<=Anleitung!$D$10),Konfig!D:E,2,FALSE))","v":""}]
["","",null,null,null,null,null,null,null,null,null,null,null,null,null,null,null,{"$f":"IF((ISBLANK(K14)),\"\",YEAR(Anleitung!$B$10-K14)-1900)","v":""},null,null,null,null,null,null,null,null,null,null,null,null,null,null,null,"",null,null,null,null,null,null,null,null,null,null,null,null,null,null,null,null,null,null,null,null,null,null,null,{"$f":"IF(OR(ISBLANK(U14),ISBLANK(BE14)),\"\",VLOOKUP(U14&\"/\"&(BE14<=Anleitung!$D$10),Konfig!D:E,2,FALSE))","v":""}]
["","",null,null,null,null,null,null,null,null,null,null,null,null,null,null,null,{"$f":"IF((ISBLANK(K15)),\"\",YEAR(Anleitung!$B$10-K15)-1900)","v":""},null,null,null,null,null,null,null,null,null,null,null,null,null,null,null,"",null,null,null,null,null,null,null,null,null,null,null,null,null,null,null,null,null,null,null,null,null,null,null,{"$f":"IF(OR(ISBLANK(U15),ISBLANK(BE15)),\"\",VLOOKUP(U15&\"/\"&(BE15<=Anleitung!$D$10),Konfig!D:E,2,FALSE))","v":""}]
["","",null,null,null,null,null,null,null,null,null,null,null,null,null,null,null,{"$f":"IF((ISBLANK(K16)),\"\",YEAR(Anleitung!$B$10-K16)-1900)","v":""},null,null,null,null,null,null,null,null,null,null,null,null,null,null,null,"",null,null,null,null,null,null,null,null,null,null,null,null,null,null,null,null,null,null,null,null,null,null,null,{"$f":"IF(OR(ISBLANK(U16),ISBLANK(BE16)),\"\",VLOOKUP(U16&\"/\"&(BE16<=Anleitung!$D$10),Konfig!D:E,2,FALSE))","v":""}]
["","",null,null,null,null,null,null,null,null,null,null,null,null,null,null,null,{"$f":"IF((ISBLANK(K17)),\"\",YEAR(Anleitung!$B$10-K17)-1900)","v":""},null,null,null,null,null,null,null,null,null,null,null,null,null,null,null,"",null,null,null,null,null,null,null,null,null,null,null,null,null,null,null,null,null,null,null,null,null,null,null,{"$f":"IF(OR(ISBLANK(U17),ISBLANK(BE17)),\"\",VLOOKUP(U17&\"/\"&(BE17<=Anleitung!$D$10),Konfig!D:E,2,FALSE))","v":""}]
["","",null,null,null,null,null,null,null,null,null,null,null,null,null,null,null,{"$f":"IF((ISBLANK(K18)),\"\",YEAR(Anleitung!$B$10-K18)-1900)","v":""},null,null,null,null,null,null,null,null,null,null,null,null,null,null,null,"",null,null,null,null,null,null,null,null,null,null,null,null,null,null,null,null,null,null,null,null,null,null,null,{"$f":"IF(OR(ISBLANK(U18),ISBLANK(BE18)),\"\",VLOOKUP(U18&\"/\"&(BE18<=Anleitung!$D$10),Konfig!D:E,2,FALSE))","v":""}]
["","",null,null,null,null,null,null,null,null,null,null,null,null,null,null,null,{"$f":"IF((ISBLANK(K19)),\"\",YEAR(Anleitung!$B$10-K19)-1900)","v":""},null,null,null,null,null,null,null,null,null,null,null,null,null,null,null,"",null,null,null,null,null,null,null,null,null,null,null,null,null,null,null,null,null,null,null,null,null,null,null,{"$f":"IF(OR(ISBLANK(U19),ISBLANK(BE19)),\"\",VLOOKUP(U19&\"/\"&(BE19<=Anleitung!$D$10),Konfig!D:E,2,FALSE))","v":""}]
["","",null,null,null,null,null,null,null,null,null,null,null,null,null,null,null,{"$f":"IF((ISBLANK(K20)),\"\",YEAR(Anleitung!$B$10-K20)-1900)","v":""},null,null,null,null,null,null,null,null,null,null,null,null,null,null,null,"",null,null,null,null,null,null,null,null,null,null,null,null,null,null,null,null,null,null,null,null,null,null,null,{"$f":"IF(OR(ISBLANK(U20),ISBLANK(BE20)),\"\",VLOOKUP(U20&\"/\"&(BE20<=Anleitung!$D$10),Konfig!D:E,2,FALSE))","v":""}]
["","",null,null,null,null,null,null,null,null,null,null,null,null,null,null,null,{"$f":"IF((ISBLANK(K21)),\"\",YEAR(Anleitung!$B$10-K21)-1900)","v":""},null,null,null,null,null,null,null,null,null,null,null,null,null,null,null,"",null,null,null,null,null,null,null,null,null,null,null,null,null,null,null,null,null,null,null,null,null,null,null,{"$f":"IF(OR(ISBLANK(U21),ISBLANK(BE21)),\"\",VLOOKUP(U21&\"/\"&(BE21<=Anleitung!$D$10),Konfig!D:E,2,FALSE))","v":""}]
["","",null,null,null,null,null,null,null,null,null,null,null,null,null,null,null,{"$f":"IF((ISBLANK(K22)),\"\",YEAR(Anleitung!$B$10-K22)-1900)","v":""},null,null,null,null,null,null,null,null,null,null,null,null,null,null,null,"",null,null,null,null,null,null,null,null,null,null,null,null,null,null,null,null,null,null,null,null,null,null,null,{"$f":"IF(OR(ISBLANK(U22),ISBLANK(BE22)),\"\",VLOOKUP(U22&\"/\"&(BE22<=Anleitung!$D$10),Konfig!D:E,2,FALSE))","v":""}]
["","",null,null,null,null,null,null,null,null,null,null,null,null,null,null,null,{"$f":"IF((ISBLANK(K23)),\"\",YEAR(Anleitung!$B$10-K23)-1900)","v":""},null,null,null,null,null,null,null,null,null,null,null,null,null,null,null,"",null,null,null,null,null,null,null,null,null,null,null,null,null,null,null,null,null,null,null,null,null,null,null,{"$f":"IF(OR(ISBLANK(U23),ISBLANK(BE23)),\"\",VLOOKUP(U23&\"/\"&(BE23<=Anleitung!$D$10),Konfig!D:E,2,FALSE))","v":""}]
["","",null,null,null,null,null,null,null,null,null,null,null,null,null,null,null,{"$f":"IF((ISBLANK(K24)),\"\",YEAR(Anleitung!$B$10-K24)-1900)","v":""},null,null,null,null,null,null,null,null,null,null,null,null,null,null,null,"",null,null,null,null,null,null,null,null,null,null,null,null,null,null,null,null,null,null,null,null,null,null,null,{"$f":"IF(OR(ISBLANK(U24),ISBLANK(BE24)),\"\",VLOOKUP(U24&\"/\"&(BE24<=Anleitung!$D$10),Konfig!D:E,2,FALSE))","v":""}]
["","",null,null,null,null,null,null,null,null,null,null,null,null,null,null,null,{"$f":"IF((ISBLANK(K25)),\"\",YEAR(Anleitung!$B$10-K25)-1900)","v":""},null,null,null,null,null,null,null,null,null,null,null,null,null,null,null,"",null,null,null,null,null,null,null,null,null,null,null,null,null,null,null,null,null,null,null,null,null,null,null,{"$f":"IF(OR(ISBLANK(U25),ISBLANK(BE25)),\"\",VLOOKUP(U25&\"/\"&(BE25<=Anleitung!$D$10),Konfig!D:E,2,FALSE))","v":""}]
["","",null,null,null,null,null,null,null,null,null,null,null,null,null,null,null,{"$f":"IF((ISBLANK(K26)),\"\",YEAR(Anleitung!$B$10-K26)-1900)","v":""},null,null,null,null,null,null,null,null,null,null,null,null,null,null,null,"",null,null,null,null,null,null,null,null,null,null,null,null,null,null,null,null,null,null,null,null,null,null,null,{"$f":"IF(OR(ISBLANK(U26),ISBLANK(BE26)),\"\",VLOOKUP(U26&\"/\"&(BE26<=Anleitung!$D$10),Konfig!D:E,2,FALSE))","v":""}]
["","",null,null,null,null,null,null,null,null,null,null,null,null,null,null,null,{"$f":"IF((ISBLANK(K27)),\"\",YEAR(Anleitung!$B$10-K27)-1900)","v":""},null,null,null,null,null,null,null,null,null,null,null,null,null,null,null,"",null,null,null,null,null,null,null,null,null,null,null,null,null,null,null,null,null,null,null,null,null,null,null,{"$f":"IF(OR(ISBLANK(U27),ISBLANK(BE27)),\"\",VLOOKUP(U27&\"/\"&(BE27<=Anleitung!$D$10),Konfig!D:E,2,FALSE))","v":""}]
["","",null,null,null,null,null,null,null,null,null,null,null,null,null,null,null,{"$f":"IF((ISBLANK(K28)),\"\",YEAR(Anleitung!$B$10-K28)-1900)","v":""},null,null,null,null,null,null,null,null,null,null,null,null,null,null,null,"",null,null,null,null,null,null,null,null,null,null,null,null,null,null,null,null,null,null,null,null,null,null,null,{"$f":"IF(OR(ISBLANK(U28),ISBLANK(BE28)),\"\",VLOOKUP(U28&\"/\"&(BE28<=Anleitung!$D$10),Konfig!D:E,2,FALSE))","v":""}]
["","",null,null,null,null,null,null,null,null,null,null,null,null,null,null,null,{"$f":"IF((ISBLANK(K29)),\"\",YEAR(Anleitung!$B$10-K29)-1900)","v":""},null,null,null,null,null,null,null,null,null,null,null,null,null,null,null,"",null,null,null,null,null,null,null,null,null,null,null,null,null,null,null,null,null,null,null,null,null,null,null,{"$f":"IF(OR(ISBLANK(U29),ISBLANK(BE29)),\"\",VLOOKUP(U29&\"/\"&(BE29<=Anleitung!$D$10),Konfig!D:E,2,FALSE))","v":""}]
["","",null,null,null,null,null,null,null,null,null,null,null,null,null,null,null,{"$f":"IF((ISBLANK(K30)),\"\",YEAR(Anleitung!$B$10-K30)-1900)","v":""},null,null,null,null,null,null,null,null,null,null,null,null,null,null,null,"",null,null,null,null,null,null,null,null,null,null,null,null,null,null,null,null,null,null,null,null,null,null,null,{"$f":"IF(OR(ISBLANK(U30),ISBLANK(BE30)),\"\",VLOOKUP(U30&\"/\"&(BE30<=Anleitung!$D$10),Konfig!D:E,2,FALSE))","v":""}]
{"$rows_left_out":21}
{"sheet":"Konfig","index":2,"n_rows":33,"n_cols":10,"rows_kept":33,"cut":false,"hidden":true,"merged":[[1,9,8,15]]}
["Beschreibung","Mitglied","rechtzeitig?","formel","Betrag",null,"Diözesen","Anreisemittel",null,"Text Textfeld"]
["Beitrag für Mitgleider","Ja",{"$f":"TRUE","v":true},{"$f":"B2&\"/\"&C2","v":"Ja/WAHR"},100,null,null,"ungeklärt",null,"Hallo,\nwir freuen uns, dass du eine Gruppe für das Bundesjugendlager anmelden willst. Bitte denke daran, dass diese Anmeldung zusammen mit einem ILA und den eingescannten Teilnehmerbögen an das Bundesjugendreferat gemailt werden muss. Du solltest bei der Mail deinen Diözesanjugendreferenten ins CC nehmen.\nBitte fülle die unten stehenden Felder aus und klicke dann auf weiter."]
["Beitrag für Nichtmitgleider","Nein",{"$f":"TRUE","v":true},{"$f":"B3&\"/\"&C3","v":"Nein/WAHR"},120,null,"Aachen","Kleinbus(se)"]
["Nachmelde-Beitrag für Mitgleider","Ja",{"$f":"FALSE","v":false},{"$f":"B4&\"/\"&C4","v":"Ja/FALSCH"},120,null,"Augsburg","PKW"]
["Nachmelde-Beitrag für Nichtmitgleider","Nein",{"$f":"FALSE","v":false},{"$f":"B5&\"/\"&C5","v":"Nein/FALSCH"},140,null,"Bamberg","Reisebus"]
[null,null,null,null,null,null,"Berlin","Bahn"]
[null,null,null,null,null,null,"Dresden-Meißen"]
[null,null,null,null,null,null,"Eichstätt"]
["Drop-Downfelder",null,null,null,null,null,"Erfurt-Meiningen"]
["Drop-Downfelder",null,null,null,null,null,"Essen"]
["Drop-Downfelder",0,null,null,null,null,"Freiburg"]
["Drop-Downfelder",1,null,null,null,null,"Fulda"]
["Drop-Downfelder",2,null,null,null,null,"Görlitz"]
["Drop-Downfelder",3,null,null,null,null,"Hamburg"]
["Drop-Downfelder",4,null,null,null,null,"Hildesheim"]
["Drop-Downfelder",5,null,null,null,null,"Köln"]
["Drop-Downfelder",null,null,null,null,null,"Limburg"]
["Drop-Downfelder","Ja",null,null,null,null,"Magdeburg"]
["Drop-Downfelder","Nein",null,null,null,null,"Mainz"]
[null,null,null,null,null,null,"München - Freising"]
["Drop-Downfelder","Schwimmer",null,null,null,null,"Münster"]
["Drop-Downfelder","Nichtschwimmer",null,null,null,null,"Offi Oldenburg"]
["Drop-Downfelder","Kinderland",null,null,null,null,"Osnabrück"]
["Drop-Downfelder","Jugendland",null,null,null,null,"Paderborn"]
[null,null,null,null,null,null,"Passau"]
[null,null,null,null,null,null,"Regensburg"]
[null,null,null,null,null,null,"Rottenburg-Stuttgart"]
[null,null,null,null,null,null,"Speyer"]
[null,null,null,null,null,null,"Trier"]
[null,null,null,null,null,null,"Würzburg"]
{"$rows_left_out":3}